BDBM50108485 3-[4-Methoxy-3'-(3-pyridin-4-ylmethyl-ureido)-biphenyl-3-sulfonylamino]-3-phenyl-propionic acid::CHEMBL62551
SMILES COc1ccc(cc1S(=O)(=O)NC(CC(O)=O)c1ccccc1)-c1cccc(NC(=O)NCc2ccncc2)c1
InChI Key InChIKey=CWFYYDMXIHUDEP-UHFFFAOYSA-N
Data  1 KI
  Tab Delimited (TSV)   2D SDfile   Computed 3D by Vconf -m prep SDfile
Find this compound or compounds like it in BindingDB:
Activity Spreadsheet -- Enzyme Inhibition Constant Data from BindingDB
Found 1 hit for monomerid = 50108485
TargetIntegrin alpha-V/beta-3(Homo sapiens (Human))
Bayer
Curated by ChEMBL
LigandPNGBDBM50108485(3-[4-Methoxy-3'-(3-pyridin-4-ylmethyl-ureido)-biph...)
Affinity DataKi:  25nM. Assay description: In vitro activity in an vitronectin receptor (alpha v beta3) scintillation bead assay using 125-I labelled echistatin as a radioligand
In DepthDetails ArticlePubMed