BDBM50109447 1-(8-Ethyl-2-furan-2-yl-8H-pyrazolo[4,3-e][1,2,4]triazolo[1,5-c]pyrimidin-5-yl)-3-(4-fluoro-phenyl)-urea::1-(8-ethyl-2-(furan-2-yl)-8H-pyrazolo[4,3-e][1,2,4]triazolo[1,5-c]pyrimidin-5-yl)-3-(4-fluorophenyl)urea::CHEMBL164685
SMILES CCn1cc2c(n1)nc(NC(=O)Nc1ccc(F)cc1)n1nc(nc21)-c1ccco1
InChI Key InChIKey=XLPDJMHOTMAAOH-UHFFFAOYSA-N
Data  9 KI
  Tab Delimited (TSV)   2D SDfile   Computed 3D by Vconf -m prep SDfile
Find this compound or compounds like it in BindingDB:
Activity Spreadsheet -- Enzyme Inhibition Constant Data from BindingDB
Found 9 hits for monomerid = 50109447
TargetAdenosine receptor A3(Homo sapiens (Human))TBA
LigandPNGBDBM50109447(1-(8-Ethyl-2-furan-2-yl-8H-pyrazolo[4,3-e][1,2,4]t...)
Affinity DataKi:  0.859nM. Assay description: Binding affinity to human adenosine A3 receptor
In DepthDetails Article
TargetAdenosine receptor A3(Homo sapiens (Human))TBA
LigandPNGBDBM50109447(1-(8-Ethyl-2-furan-2-yl-8H-pyrazolo[4,3-e][1,2,4]t...)
Affinity DataKi:  0.860nM. Assay description: Displacement of [3H]NECA from human adenosine A3 receptor expressed in CHO cellsChecked by Author
In DepthDetails ArticlePubMed
TargetAdenosine receptor A3(Homo sapiens (Human))TBA
LigandPNGBDBM50109447(1-(8-Ethyl-2-furan-2-yl-8H-pyrazolo[4,3-e][1,2,4]t...)
Affinity DataKi:  0.860nM. Assay description: Displacement of [3H]-MRE3008-F20 binding at human Adenosine A3 receptor expressed in HEK cells; range 0.77-0.97
In DepthDetails ArticlePubMed
TargetAdenosine receptor A3(Homo sapiens (Human))TBA
LigandPNGBDBM50109447(1-(8-Ethyl-2-furan-2-yl-8H-pyrazolo[4,3-e][1,2,4]t...)
Affinity DataKi:  0.860nM. Assay description: Binding affinity for human adenosine A3 receptor
In DepthDetails ArticlePubMed
TargetAdenosine receptor A2a(Homo sapiens (Human))
Università
Curated by ChEMBL
LigandPNGBDBM50109447(1-(8-Ethyl-2-furan-2-yl-8H-pyrazolo[4,3-e][1,2,4]t...)
Affinity DataKi:  60nM. Assay description: Displacement of [3H]-SCH-58,261 from human Adenosine A2A receptor expressed in HEK-293 cells; range 48-78
In DepthDetails ArticlePubMed
TargetAdenosine receptor A2a(Homo sapiens (Human))
Università
Curated by ChEMBL
LigandPNGBDBM50109447(1-(8-Ethyl-2-furan-2-yl-8H-pyrazolo[4,3-e][1,2,4]t...)
Affinity DataKi:  60nM. Assay description: Displacement of [3H]NECA from human adenosine A2A receptor expressed in CHO cellsChecked by Author
In DepthDetails ArticlePubMed
TargetAdenosine receptor A2b(Homo sapiens (Human))
Università
Curated by ChEMBL
LigandPNGBDBM50109447(1-(8-Ethyl-2-furan-2-yl-8H-pyrazolo[4,3-e][1,2,4]t...)
Affinity DataKi:  246nM. Assay description: Displacement of [3H]-DPCPX from human Adenosine A2B receptor expressed in HEK-293 cells; range 211-287
In DepthDetails ArticlePubMed
TargetAdenosine receptor A1(Homo sapiens (Human))
Università
Curated by ChEMBL
LigandPNGBDBM50109447(1-(8-Ethyl-2-furan-2-yl-8H-pyrazolo[4,3-e][1,2,4]t...)
Affinity DataKi:  602nM. Assay description: Displacement of [3H]-DPCPX from human Adenosine A1 receptor expressed in CHO cells; range 509-712
In DepthDetails ArticlePubMed
TargetAdenosine receptor A3(Homo sapiens (Human))TBA
LigandPNGBDBM50109447(1-(8-Ethyl-2-furan-2-yl-8H-pyrazolo[4,3-e][1,2,4]t...)
Affinity DataKi:  851nM. Assay description: Displacement of [3H]MRE3008-F20 from human adenosine A3 receptor expressed in CHO cells after 120 mins
In DepthDetails ArticlePubMed