BDBM50110295 (7-Chloro-quinolin-4-yl)-(6-piperidin-1-yl-hexyl)-amine; Oxalic acid::CHEMBL14665
SMILES Clc1ccc2c(NCCCCCCN3CCCCC3)ccnc2c1
InChI Key InChIKey=MZYVSWGTJQFSPP-UHFFFAOYSA-N
Data  1 KI  1 IC50
  Tab Delimited (TSV)   2D SDfile   Computed 3D by Vconf -m prep SDfile
Find this compound or compounds like it in BindingDB:
Activity Spreadsheet -- Enzyme Inhibition Constant Data from BindingDB
Found 2 hits for monomerid = 50110295
TargetHistamine H3 receptor(Homo sapiens (Human))
Freie UniversitäT Berlin
Curated by ChEMBL
LigandPNGBDBM50110295((7-Chloro-quinolin-4-yl)-(6-piperidin-1-yl-hexyl)-...)
Affinity DataKi:  18nM. Assay description: Affinity for displacement of [125I]-iodoproxyfan from human histamine H3 receptors stably expressed in CHO cells
In DepthDetails ArticlePubMed
TargetHistamine N-methyltransferase(Rattus norvegicus)
Freie UniversitäT Berlin
Curated by ChEMBL
LigandPNGBDBM50110295((7-Chloro-quinolin-4-yl)-(6-piperidin-1-yl-hexyl)-...)
Affinity DataIC50:  180nM. Assay description: Inhibition of rat kidney Histamine N-Methyltransferase (HMT) activity determined by the formation of N-methylhistamine
In DepthDetails ArticlePubMed