BDBM50110296 CHEMBL14868::{4-[4-(3-Piperidin-1-yl-propoxy)-phenyl]-butyl}-(1,2,3,4-tetrahydro-acridin-9-yl)-amine; Oxalic acid
SMILES C(CCc1ccc(OCCCN2CCCCC2)cc1)CNc1c2CCCCc2nc2ccccc12
InChI Key InChIKey=BLTJGVWWJCNJJL-UHFFFAOYSA-N
Data  1 IC50
  Tab Delimited (TSV)   2D SDfile   Computed 3D by Vconf -m prep SDfile
Find this compound or compounds like it in BindingDB:
Activity Spreadsheet -- Enzyme Inhibition Constant Data from BindingDB
Found 1 hit for monomerid = 50110296
TargetHistamine N-methyltransferase(Rattus norvegicus)
Freie UniversitäT Berlin
Curated by ChEMBL
LigandPNGBDBM50110296(CHEMBL14868 | {4-[4-(3-Piperidin-1-yl-propoxy)-phe...)
Affinity DataIC50:  48nM. Assay description: Inhibition of rat kidney Histamine N-Methyltransferase (HMT) activity determined by the formation of N-methylhistamine
In DepthDetails ArticlePubMed