BDBM50110539 1-{1-[4-(Benzo[1,3]dioxole-5-sulfonyl)-phenyl]-ethyl}-4-cyclohexyl-2-methyl-piperazine::CHEMBL349497
SMILES C[C@H](N1CCN(C[C@H]1C)C1CCCCC1)c1ccc(cc1)S(=O)(=O)c1ccc2OCOc2c1
InChI Key InChIKey=GQMBOHPGAUQZPU-UXHICEINSA-N
Data  1 KI
  Tab Delimited (TSV)   2D SDfile   Computed 3D by Vconf -m prep SDfile
Find this compound or compounds like it in BindingDB:
Activity Spreadsheet -- Enzyme Inhibition Constant Data from BindingDB
Found 1 hit for monomerid = 50110539
TargetMuscarinic acetylcholine receptor M2(Homo sapiens (Human))
Schering-Plough Research Institute
Curated by ChEMBL
LigandPNGBDBM50110539(1-{1-[4-(Benzo[1,3]dioxole-5-sulfonyl)-phenyl]-eth...)
Affinity DataKi:  0.0300nM. Assay description: Binding affinity against human cloned Muscarinic acetylcholine receptor M2.
In DepthDetails ArticlePubMed