BDBM50110555 CHEMBL164935::[4-((R)-4-{(S)-1-[4-(Benzo[1,3]dioxole-5-sulfonyl)-phenyl]-ethyl}-3-methyl-piperazin-1-yl)-piperidin-1-yl]-(2-methoxy-phenyl)-methanone
SMILES COc1ccccc1C(=O)N1CCC(CC1)N1CCN([C@@H](C)c2ccc(cc2)S(=O)(=O)c2ccc3OCOc3c2)[C@H](C)C1
InChI Key InChIKey=BKXOTORSBCICHR-RPWUZVMVSA-N
Data  1 KI
  Tab Delimited (TSV)   2D SDfile   Computed 3D by Vconf -m prep SDfile
Find this compound or compounds like it in BindingDB:
Activity Spreadsheet -- Enzyme Inhibition Constant Data from BindingDB
Found 1 hit for monomerid = 50110555
TargetMuscarinic acetylcholine receptor M2(Homo sapiens (Human))
Schering-Plough Research Institute
Curated by ChEMBL
LigandPNGBDBM50110555(CHEMBL164935 | [4-((R)-4-{(S)-1-[4-(Benzo[1,3]diox...)
Affinity DataKi:  0.100nM. Assay description: Binding affinity against human muscarinic acetylcholine receptor M2 using [3H]-N-methylscopolamine as radioligand
In DepthDetails ArticlePubMed