BDBM50111292 8-{4-[(6-Benzo[b]thiophen-2-yl-4-hydroxy-2-oxo-1,2-dihydro-quinoline-3-carbonyl)-amino]-phenoxy}-octanoic acid::CHEMBL10014
SMILES OC(=O)CCCCCCCOc1ccc(NC(=O)c2c(O)c3cc(ccc3[nH]c2=O)-c2cc3ccccc3s2)cc1
InChI Key InChIKey=SBPRVIIGLBVMMX-UHFFFAOYSA-N
Data  1 IC50
  Tab Delimited (TSV)   2D SDfile   Computed 3D by Vconf -m prep SDfile
Find this compound or compounds like it in BindingDB:
Activity Spreadsheet -- Enzyme Inhibition Constant Data from BindingDB
Found 1 hit for monomerid = 50111292
TargetPlasminogen activator inhibitor 1(Homo sapiens (Human))
Xenova
Curated by ChEMBL
LigandPNGBDBM50111292(8-{4-[(6-Benzo[b]thiophen-2-yl-4-hydroxy-2-oxo-1,2...)
Affinity DataIC50:  500nM. Assay description: Inhibitory activity against human plasminogen activator inhibitor-1(PAI-1) evaluated by chromogenic assay.
In DepthDetails ArticlePubMed