BDBM50111749 CHEMBL3605098
SMILES Nc1ncc(-c2ccc(cc2)N2CCOCC2)c2scc(-c3ccc(Oc4ccccc4)cc3)c12
InChI Key InChIKey=ZQQWMVDSUUFGAZ-XKXSSWDPSA-N
Data  1 IC50
  Tab Delimited (TSV)   2D SDfile   Computed 3D by Vconf -m prep SDfile
Find this compound or compounds like it in BindingDB:
Activity Spreadsheet -- Enzyme Inhibition Constant Data from BindingDB
Found 1 hit for monomerid = 50111749
TargetTyrosine-protein kinase BTK(Homo sapiens (Human))
China Pharmaceutical University
Curated by ChEMBL
LigandPNGBDBM50111749(CHEMBL3605098)
Affinity DataIC50:  2.30E+3nM. Assay description: Inhibition of human recombinant BTK incubated for 5 mins by HTRF kinase assay
In DepthDetails ArticlePubMed