BDBM50111750 CHEMBL3605097
SMILES Nc1ncc(-c2ccncc2)c2scc(-c3ccc(Oc4ccccc4)cc3)c12
InChI Key InChIKey=NZRGWJFAVCBWFI-UDHQNBHYSA-N
Data  1 IC50
  Tab Delimited (TSV)   2D SDfile   Computed 3D by Vconf -m prep SDfile
Find this compound or compounds like it in BindingDB:
Activity Spreadsheet -- Enzyme Inhibition Constant Data from BindingDB
Found 1 hit for monomerid = 50111750
TargetTyrosine-protein kinase BTK(Homo sapiens (Human))
China Pharmaceutical University
Curated by ChEMBL
LigandPNGBDBM50111750(CHEMBL3605097)
Affinity DataIC50:  1.95E+3nM. Assay description: Inhibition of human recombinant BTK incubated for 5 mins by HTRF kinase assay
In DepthDetails ArticlePubMed