BDBM50111761 CHEMBL3605104
SMILES CCCCn1cc(cn1)-c1cnc(N)c2c(csc12)-c1ccc(Oc2ccccc2)cc1
InChI Key InChIKey=AAVULQQRTINIET-VXAIIWMZSA-N
Data  1 IC50
  Tab Delimited (TSV)   2D SDfile   Computed 3D by Vconf -m prep SDfile
Find this compound or compounds like it in BindingDB:
Activity Spreadsheet -- Enzyme Inhibition Constant Data from BindingDB
Found 1 hit for monomerid = 50111761
TargetTyrosine-protein kinase BTK(Homo sapiens (Human))
China Pharmaceutical University
Curated by ChEMBL
LigandPNGBDBM50111761(CHEMBL3605104)
Affinity DataIC50:  387nM. Assay description: Inhibition of human recombinant BTK incubated for 5 mins by HTRF kinase assay
In DepthDetails ArticlePubMed