BDBM50112047 CHEMBL176949::Sodium; (R)-2-eth-(E)-ylidene-1-oxo-2,2a,2b,3,5,6-hexahydro-1H-4-thia-7a-aza-cyclobuta[a]indene-7-carboxylate
SMILES C\C=C1/[C@H]2C3CSCCC3=C(N2C1=O)C([O-])=O
InChI Key InChIKey=CJHIIEVRZUZNQE-XBIFLVPGSA-M
Data  2 IC50
  Tab Delimited (TSV)   2D SDfile   Computed 3D by Vconf -m prep SDfile
Find this compound or compounds like it in BindingDB:
Activity Spreadsheet -- Enzyme Inhibition Constant Data from BindingDB
Found 2 hits for monomerid = 50112047
TargetBeta-lactamase(Enterobacter cloacae)
Lek
Curated by ChEMBL
LigandPNGBDBM50112047(CHEMBL176949 | Sodium; (R)-2-eth-(E)-ylidene-1-oxo...)
Affinity DataIC50:  4.20E+3nM. Assay description: The compound was tested for its inhibitory activity towards Class C beta-lactamase from Enterobacter cloacae 908R at 0.8 umol concentration
In DepthDetails ArticlePubMed
TargetBeta-lactamase TEM(Escherichia coli)
Lek
Curated by ChEMBL
LigandPNGBDBM50112047(CHEMBL176949 | Sodium; (R)-2-eth-(E)-ylidene-1-oxo...)
Affinity DataIC50:  1.00E+5nM. Assay description: The compound was tested for its inhibitory activity towards Class A TEM-1 beta-lactamase from Escherichia coli at 0.3 umol
In DepthDetails ArticlePubMed