BDBM50112397 CHEMBL22323::Sodium;4-chloro-N-{[(4-cyano-3-methyl-1-phenyl-1H-pyrazol-5-yl)amino]carbonyl}benzenesulfonamide
SMILES Cc1nn(c(NC(=O)[N-]S(=O)(=O)c2ccc(Cl)cc2)c1C#N)-c1ccccc1
InChI Key InChIKey=RVEVSYZWAQJZSQ-UHFFFAOYSA-M
Data  1 IC50
  Tab Delimited (TSV)   2D SDfile   Computed 3D by Vconf -m prep SDfile
Find this compound or compounds like it in BindingDB:
Activity Spreadsheet -- Enzyme Inhibition Constant Data from BindingDB
Found 1 hit for monomerid = 50112397
TargetEndothelin-converting enzyme 1(Rattus norvegicus (Rat))
Sumitomo Pharmaceuticals
Curated by ChEMBL
LigandPNGBDBM50112397(CHEMBL22323 | Sodium;4-chloro-N-{[(4-cyano-3-methy...)
Affinity DataIC50:  42nM. Assay description: Tested in vitro for inhibition of Endothelin-converting enzyme (ECE) of rat lung membrane
In DepthDetails ArticlePubMed