BDBM50113646 CHEMBL37105::Huperzine Analogue
SMILES CCC1=C2C3Cc4[nH]c(=O)ccc4C2(CC(C)=C3)NC1
InChI Key InChIKey=LWKCOSFHDJDLBU-UHFFFAOYSA-N
Data  1 KI
  Tab Delimited (TSV)   2D SDfile   Computed 3D by Vconf -m prep SDfile
Find this compound or compounds like it in BindingDB:
Activity Spreadsheet -- Enzyme Inhibition Constant Data from BindingDB
Found 1 hit for monomerid = 50113646
TargetAcetylcholinesterase(Bos taurus (bovine))
Georgetown University Medical Center
Curated by ChEMBL
LigandPNGBDBM50113646(CHEMBL37105 | Huperzine Analogue)
Affinity DataKi:  400nM. Assay description: Inhibitory constant against fetal bovine serum (FBS) acetylcholinesterase
In DepthDetails ArticlePubMed