BDBM50114037 4-{3-[2-(3-Biphenyl-4-yl-5-methyl-[1,2,4]triazol-4-yl)-phenoxy]-propyl}-piperidine::CHEMBL315232
SMILES Cc1nnc(-c2ccc(cc2)-c2ccccc2)n1-c1ccccc1OCCCC1CCNCC1
InChI Key InChIKey=QTEHMOPQNLCPBL-UHFFFAOYSA-N
Data  2 KI
  Tab Delimited (TSV)   2D SDfile   Computed 3D by Vconf -m prep SDfile
Find this compound or compounds like it in BindingDB:
Activity Spreadsheet -- Enzyme Inhibition Constant Data from BindingDB
Found 2 hits for monomerid = 50114037
TargetVasopressin V1a receptor(Homo sapiens (Human))
Yamanouchi Pharmaceutical
Curated by ChEMBL
LigandPNGBDBM50114037(4-{3-[2-(3-Biphenyl-4-yl-5-methyl-[1,2,4]triazol-4...)
Affinity DataKi:  7.84nM. Assay description: Binding affinity at cloned human Vasopressin V1a receptor stably expressed in CHO cells, using [3H]-AVP as radioligand
In DepthDetails ArticlePubMed
TargetVasopressin V2 receptor(Homo sapiens (Human))
Yamanouchi Pharmaceutical
Curated by ChEMBL
LigandPNGBDBM50114037(4-{3-[2-(3-Biphenyl-4-yl-5-methyl-[1,2,4]triazol-4...)
Affinity DataKi:  7.37E+3nM. Assay description: Binding affinity at cloned human Vasopressin V2 receptor stably expressed in CHO cells, using [3H]-AVP as radioligand
In DepthDetails ArticlePubMed