BDBM50115191 CHEMBL3609573
SMILES CC(C)(C)OC(=O)c1c(O)c(ccc1COc1ccc(cc1)-c1ccc(CC(O)=O)cc1)C(F)(F)F
InChI Key InChIKey=XWHRMVBUKJEZFY-UHFFFAOYSA-N
Data  2 EC50
PDB links: 1 PDB ID matches this monomer.
  Tab Delimited (TSV)   2D SDfile   Computed 3D by Vconf -m prep SDfile
Find this compound or compounds like it in BindingDB:
Activity Spreadsheet -- Enzyme Inhibition Constant Data from BindingDB
Found 2 hits for monomerid = 50115191
TargetOxysterols receptor LXR-alpha(Homo sapiens (Human))
Daiichi Sankyo Rd Novare
Curated by ChEMBL
LigandPNGBDBM50115191(CHEMBL3609573)
Affinity DataEC50:  510nM. Assay description: Agonist activity at human LXRalpha expressed in African green monkey kidney CV1 cells co-expressing pTAL-LXRE including LXR response element incubate...
TargetOxysterols receptor LXR-beta(Homo sapiens (Human))
Daiichi Sankyo Rd Novare
Curated by ChEMBL
LigandPNGBDBM50115191(CHEMBL3609573)
Affinity DataEC50:  160nM. Assay description: Agonist activity at human LXRbeta expressed in African green monkey kidney CV1 cells co-expressing pTAL-LXRE including LXR response element incubated...
In DepthDetails ArticlePubMed