BDBM50115193 CHEMBL3609363
SMILES CN(C(C)=O)c1ccc(OCc2ccc(c(O)c2C(=O)OC(C)(C)C)C(F)(F)F)cc1
InChI Key InChIKey=XRYDEEKHRNPJOZ-UHFFFAOYSA-N
Data  2 EC50
  Tab Delimited (TSV)   2D SDfile   Computed 3D by Vconf -m prep SDfile
Find this compound or compounds like it in BindingDB:
Activity Spreadsheet -- Enzyme Inhibition Constant Data from BindingDB
Found 2 hits for monomerid = 50115193
TargetOxysterols receptor LXR-alpha(Homo sapiens (Human))
Daiichi Sankyo Rd Novare
Curated by ChEMBL
LigandPNGBDBM50115193(CHEMBL3609363)
Affinity DataEC50:  280nM. Assay description: Agonist activity at human LXRalpha expressed in African green monkey kidney CV1 cells co-expressing pTAL-LXRE including LXR response element incubate...
In DepthDetails ArticlePubMed
TargetOxysterols receptor LXR-beta(Homo sapiens (Human))
Daiichi Sankyo Rd Novare
Curated by ChEMBL
LigandPNGBDBM50115193(CHEMBL3609363)
Affinity DataEC50:  260nM. Assay description: Agonist activity at human LXRbeta expressed in African green monkey kidney CV1 cells co-expressing pTAL-LXRE including LXR response element incubated...
In DepthDetails ArticlePubMed