BDBM50115284 4,5a,6,7,8,9a-Hexahydro-5H-9-oxa-3-thia-6-aza-cyclopenta[a]naphthalene::CHEMBL319051
SMILES C1COC2C(CCc3sccc23)N1
InChI Key InChIKey=SGHOLEWCWYFPCZ-UHFFFAOYSA-N
Data  2 KI
  Tab Delimited (TSV)   2D SDfile   Computed 3D by Vconf -m prep SDfile
Find this compound or compounds like it in BindingDB:
Activity Spreadsheet -- Enzyme Inhibition Constant Data from BindingDB
Found 2 hits for monomerid = 50115284
TargetD(3) dopamine receptor(Homo sapiens (Human))
University Of Groningen
Curated by ChEMBL
LigandPNGBDBM50115284(4,5a,6,7,8,9a-Hexahydro-5H-9-oxa-3-thia-6-aza-cycl...)
Affinity DataKi:  3.00E+3nM. Assay description: In vitro binding affinity at human Dopamine receptor D3 expressed in CHO K1 cells was measured by its ability to displace [3H]spiperone
In DepthDetails ArticlePubMed
TargetD(2) dopamine receptor(Homo sapiens (Human))
University Of Groningen
Curated by ChEMBL
LigandPNGBDBM50115284(4,5a,6,7,8,9a-Hexahydro-5H-9-oxa-3-thia-6-aza-cycl...)
Affinity DataKi: >4.78E+3nM. Assay description: In vitro binding affinity at human Dopamine receptor D2 expressed in CHO K1 cells was measured by its ability to displace [3H]- N-0437
In DepthDetails ArticlePubMed