BDBM50116161 (S)-3-(2'-Methoxy-biphenyl-4-yl)-2-[(1'-methyl-2',3',5',6'-tetrahydro-1'H-[3,4']bipyridinyl-4'-carbonyl)-amino]-propionic acid::CHEMBL65804
SMILES COc1ccccc1-c1ccc(C[C@H](NC(=O)C2(CCN(C)CC2)c2cccnc2)C(O)=O)cc1
InChI Key InChIKey=OXXLQTUSOSKCPA-DEOSSOPVSA-N
Data  1 IC50
  Tab Delimited (TSV)   2D SDfile   Computed 3D by Vconf -m prep SDfile
Find this compound or compounds like it in BindingDB:
Activity Spreadsheet -- Enzyme Inhibition Constant Data from BindingDB
Found 1 hit for monomerid = 50116161
TargetIntegrin alpha-4/beta-7(Homo sapiens (Human))
Merck Research Laboratories
Curated by ChEMBL
LigandPNGBDBM50116161((S)-3-(2'-Methoxy-biphenyl-4-yl)-2-[(1'-methyl-2',...)
Affinity DataIC50:  51nM. Assay description: Inhibition of alpha4-beta7 integrin binding to radiolabeled vascular cell adhesion molecule-1 (VCAM-1) Ig fusion protein in human Jurkat cells
In DepthDetails ArticlePubMed