BDBM50116176 (S)-3-(2'-Methoxy-biphenyl-4-yl)-2-{[1-(1-methyl-6-oxo-1,6-dihydro-pyridin-3-yl)-cyclopentanecarbonyl]-amino}-propionic acid::CHEMBL65832
SMILES COc1ccccc1-c1ccc(C[C@H](NC(=O)C2(CCCC2)c2ccc(=O)n(C)c2)C(O)=O)cc1
InChI Key InChIKey=FMKGFWRZZBCUCK-QHCPKHFHSA-N
Data  1 IC50
  Tab Delimited (TSV)   2D SDfile   Computed 3D by Vconf -m prep SDfile
Find this compound or compounds like it in BindingDB:
Activity Spreadsheet -- Enzyme Inhibition Constant Data from BindingDB
Found 1 hit for monomerid = 50116176
TargetIntegrin alpha-4/beta-7(Homo sapiens (Human))
Merck Research Laboratories
Curated by ChEMBL
LigandPNGBDBM50116176((S)-3-(2'-Methoxy-biphenyl-4-yl)-2-{[1-(1-methyl-6...)
Affinity DataIC50:  18nM. Assay description: Inhibition of alpha4-beta7 integrin binding to radiolabeled vascular cell adhesion molecule-1 (VCAM-1) Ig fusion protein in human Jurkat cells
In DepthDetails ArticlePubMed