BDBM50116178 (S)-3-(2'-Methoxy-biphenyl-4-yl)-2-[(1-phenyl-cyclopentanecarbonyl)-amino]-propionic acid::CHEMBL304351
SMILES COc1ccccc1-c1ccc(C[C@H](NC(=O)C2(CCCC2)c2ccccc2)C(O)=O)cc1
InChI Key InChIKey=GUIMDYNJLIADDB-DEOSSOPVSA-N
Data  1 IC50
  Tab Delimited (TSV)   2D SDfile   Computed 3D by Vconf -m prep SDfile
Find this compound or compounds like it in BindingDB:
Activity Spreadsheet -- Enzyme Inhibition Constant Data from BindingDB
Found 1 hit for monomerid = 50116178
TargetIntegrin alpha-4/beta-7(Homo sapiens (Human))
Merck Research Laboratories
Curated by ChEMBL
LigandPNGBDBM50116178((S)-3-(2'-Methoxy-biphenyl-4-yl)-2-[(1-phenyl-cycl...)
Affinity DataIC50:  110nM. Assay description: Inhibition of alpha4-beta7 integrin binding to radiolabeled vascular cell adhesion molecule-1 (VCAM-1) Ig fusion protein in human Jurkat cells
In DepthDetails ArticlePubMed