BDBM50116186 (S)-2-[(1-Isoquinolin-4-yl-cyclopentanecarbonyl)-amino]-3-(2'-methoxy-biphenyl-4-yl)-propionic acid::CHEMBL302097
SMILES COc1ccccc1-c1ccc(C[C@H](NC(=O)C2(CCCC2)c2cncc3ccccc23)C(O)=O)cc1
InChI Key InChIKey=SFOPKWDSFYOUGN-MHZLTWQESA-N
Data  1 IC50
  Tab Delimited (TSV)   2D SDfile   Computed 3D by Vconf -m prep SDfile
Find this compound or compounds like it in BindingDB:
Activity Spreadsheet -- Enzyme Inhibition Constant Data from BindingDB
Found 1 hit for monomerid = 50116186
TargetIntegrin alpha-4/beta-7(Homo sapiens (Human))
Merck Research Laboratories
Curated by ChEMBL
LigandPNGBDBM50116186((S)-2-[(1-Isoquinolin-4-yl-cyclopentanecarbonyl)-a...)
Affinity DataIC50:  120nM. Assay description: Inhibition of alpha4-beta7 integrin binding to radiolabeled vascular cell adhesion molecule-1 (VCAM-1) Ig fusion protein in human Jurkat cells
In DepthDetails ArticlePubMed