BDBM50116569 CHEMBL3608940
SMILES CO[C@H]1C[C@@](CCN(C)CCCc2nc3ccccc3[nH]2)(OC(=O)C(C)C)[C@@H](C(C)C)c2ccc(F)cc12
InChI Key InChIKey=HQBVENHUOCSWIS-DEDOGFMKSA-N
Data  2 IC50
  Tab Delimited (TSV)   2D SDfile   Computed 3D by Vconf -m prep SDfile
Find this compound or compounds like it in BindingDB:
Activity Spreadsheet -- Enzyme Inhibition Constant Data from BindingDB
Found 2 hits for monomerid = 50116569
TargetVoltage-dependent T-type calcium channel subunit alpha-1H(Homo sapiens (Human))
Actelion Pharmaceuticals
Curated by ChEMBL
LigandPNGBDBM50116569(CHEMBL3608940)
Affinity DataIC50:  318nM. Assay description: Inhibition of recombinant Cav3.2 channel (unknown origin) expressed in HEK293 cells assessed as effect on calcium flux incubated for 3 mins by FLIPR ...
In DepthDetails ArticlePubMed
TargetVoltage-dependent L-type calcium channel subunit alpha-1C(Homo sapiens (Human))
Actelion Pharmaceuticals
Curated by ChEMBL
LigandPNGBDBM50116569(CHEMBL3608940)
Affinity DataIC50:  403nM. Assay description: Inhibition of recombinant Cav1.2 channel (unknown origin) expressed in HEK293 cells assessed as effect on calcium flux incubated for 3 mins by FLIPR ...
In DepthDetails ArticlePubMed