BDBM50116596 CHEMBL331581::N-(9-Ethyl-9H-carbazol-4-yl)-3-pyridin-4-yl-propionamide
SMILES CCn1c2ccccc2c2c(NC(=O)CCc3ccncc3)cccc12
InChI Key InChIKey=CIPLXHNAONEVNM-UHFFFAOYSA-N
Data  1 IC50
  Tab Delimited (TSV)   2D SDfile   Computed 3D by Vconf -m prep SDfile
Find this compound or compounds like it in BindingDB:
Activity Spreadsheet -- Enzyme Inhibition Constant Data from BindingDB
Found 1 hit for monomerid = 50116596
TargetNeuropeptide Y receptor type 5(Homo sapiens (Human))
Astrazeneca
Curated by ChEMBL
LigandPNGBDBM50116596(CHEMBL331581 | N-(9-Ethyl-9H-carbazol-4-yl)-3-pyri...)
Affinity DataIC50: >1.00E+4nM. Assay description: Binding affinity to the human Neuropeptide Y receptor Y5 (NPY5)
In DepthDetails ArticlePubMed