BDBM50116604 CHEMBL327151::N-(4-Benzoyl-phenyl)-3-pyridin-4-yl-propionamide
SMILES O=C(CCc1ccncc1)Nc1ccc(cc1)C(=O)c1ccccc1
InChI Key InChIKey=GQNUYOCQSJEZFY-UHFFFAOYSA-N
Data  1 IC50
  Tab Delimited (TSV)   2D SDfile   Computed 3D by Vconf -m prep SDfile
Find this compound or compounds like it in BindingDB:
Activity Spreadsheet -- Enzyme Inhibition Constant Data from BindingDB
Found 1 hit for monomerid = 50116604
TargetNeuropeptide Y receptor type 5(Homo sapiens (Human))
Astrazeneca
Curated by ChEMBL
LigandPNGBDBM50116604(CHEMBL327151 | N-(4-Benzoyl-phenyl)-3-pyridin-4-yl...)
Affinity DataIC50:  300nM. Assay description: Binding affinity to the human Neuropeptide Y receptor Y5 (NPY5)
In DepthDetails ArticlePubMed