BDBM50117990 CHEMBL2236844
SMILES COc1ccc(cc1)C(=O)\C=C\c1ccccc1OC
InChI Key InChIKey=HMDJBCCQNPFTJV-UHFFFAOYSA-N
Data  2 IC50
  Tab Delimited (TSV)   2D SDfile   Computed 3D by Vconf -m prep SDfile
Find this compound or compounds like it in BindingDB:
Activity Spreadsheet -- Enzyme Inhibition Constant Data from BindingDB
Found 2 hits for monomerid = 50117990
TargetAmine oxidase [flavin-containing] B(Homo sapiens (Human))
Korea Institute Of Science And Technology
Curated by ChEMBL
LigandPNGBDBM50117990(CHEMBL2236844)
Affinity DataIC50:  419nM. Assay description: Inhibition of recombinant human MAOB using benzylamine as substrate after 30 mins by Amplex red based spectrophotometric analysis
In DepthDetails ArticlePubMed
TargetAmine oxidase [flavin-containing] A(Homo sapiens (Human))
Korea Institute Of Science And Technology
Curated by ChEMBL
LigandPNGBDBM50117990(CHEMBL2236844)
Affinity DataIC50: >1.00E+5nM. Assay description: Inhibition of recombinant human MAOA using p-tyramine as substrate after 30 mins by Amplex red based spectrophotometric analysis
In DepthDetails ArticlePubMed