BDBM50117999 CHEMBL3613266
SMILES Oc1ccc(NC(=O)\C=C\c2ccccc2C(F)(F)F)cc1
InChI Key InChIKey=XKTOSIJLIXOLLM-UHFFFAOYSA-N
Data  2 IC50
  Tab Delimited (TSV)   2D SDfile   Computed 3D by Vconf -m prep SDfile
Find this compound or compounds like it in BindingDB:
Activity Spreadsheet -- Enzyme Inhibition Constant Data from BindingDB
Found 2 hits for monomerid = 50117999
TargetAmine oxidase [flavin-containing] B(Homo sapiens (Human))
Korea Institute Of Science And Technology
Curated by ChEMBL
LigandPNGBDBM50117999(CHEMBL3613266)
Affinity DataIC50: >1.00E+4nM. Assay description: Inhibition of recombinant human MAOB using benzylamine as substrate after 30 mins by Amplex red based spectrophotometric analysis
In DepthDetails ArticlePubMed
TargetAmine oxidase [flavin-containing] A(Homo sapiens (Human))
Korea Institute Of Science And Technology
Curated by ChEMBL
LigandPNGBDBM50117999(CHEMBL3613266)
Affinity DataIC50:  9.22E+3nM. Assay description: Inhibition of recombinant human MAOA using p-tyramine as substrate after 30 mins by Amplex red based spectrophotometric analysis
In DepthDetails ArticlePubMed