BDBM50118478 CHEMBL3613749
SMILES Cc1ncc(Cl)cc1NCc1ccc(s1)C(=O)N[C@@H](CC1CCCC1)C(=O)NC1CC1
InChI Key InChIKey=IVDUVEGCMXCMSO-FQEVSTJZSA-N
Data  4 IC50
  Tab Delimited (TSV)   2D SDfile   Computed 3D by Vconf -m prep SDfile
Find this compound or compounds like it in BindingDB:
Activity Spreadsheet -- Enzyme Inhibition Constant Data from BindingDB
Found 1 hit for monomerid = 50118478
TargetProtein phosphatase 1D(Homo sapiens (Human))
Hokkaido University
Curated by ChEMBL
LigandPNGBDBM50118478(CHEMBL3613749)
Affinity DataIC50:  86nM. Assay description: Inhibition of His-tagged PPM1D (1 to 420 residues) (unknown origin) expressed in Escherichia coli BL21 (DE3) pLysS cells using Ac-VEPPLS(P)QETFSDLW-N...
In DepthDetails ArticlePubMed