BDBM50118646 2-[(S)-2-((S)-4-Amino-4-carboxy-butyrylamino)-4-methyl-pentanoylamino]-4-methyl-pentanoic acid::CHEMBL90192
SMILES CC(C)C[C@H](NC(=O)[C@H](CC(C)C)NC(=O)CC[C@H](N)C(O)=O)C(O)=O
InChI Key InChIKey=QMNWSMZLXWGCNG-AVGNSLFASA-N
Data  1 IC50
  Tab Delimited (TSV)   2D SDfile   Computed 3D by Vconf -m prep SDfile
Find this compound or compounds like it in BindingDB:
Activity Spreadsheet -- Enzyme Inhibition Constant Data from BindingDB
Found 1 hit for monomerid = 50118646
TargetGlutathionylspermidine synthase(Crithidia fasciculata)
University Of Antwerp (Uia)
Curated by ChEMBL
LigandPNGBDBM50118646(2-[(S)-2-((S)-4-Amino-4-carboxy-butyrylamino)-4-me...)
Affinity DataIC50:  3.65E+5nM. Assay description: Tested against glutathionylspermidine synthetase (GspS) in Crithidia fasciculata
In DepthDetails ArticlePubMed