BDBM50118647 2-[(S)-2-((S)-4-Amino-4-carboxy-butyrylamino)-4-methyl-pentanoylamino]-pentanoic acid::CHEMBL91671
SMILES CCC[C@H](NC(=O)[C@H](CC(C)C)NC(=O)CC[C@H](N)C(O)=O)C(O)=O
InChI Key InChIKey=JRMMAQCMYYZTAJ-SRVKXCTJSA-N
Data  1 IC50
  Tab Delimited (TSV)   2D SDfile   Computed 3D by Vconf -m prep SDfile
Find this compound or compounds like it in BindingDB:
Activity Spreadsheet -- Enzyme Inhibition Constant Data from BindingDB
Found 1 hit for monomerid = 50118647
TargetGlutathionylspermidine synthase(Crithidia fasciculata)
University Of Antwerp (Uia)
Curated by ChEMBL
LigandPNGBDBM50118647(2-[(S)-2-((S)-4-Amino-4-carboxy-butyrylamino)-4-me...)
Affinity DataIC50:  1.45E+5nM. Assay description: Tested against glutathionylspermidine synthetase (GspS) in Crithidia fasciculata
In DepthDetails ArticlePubMed