BDBM50118649 (S)-2-Amino-4-[1-((S)-(S)-2-carbamoyl-1-carboxy-ethylcarbamoyl)-3-methyl-butylcarbamoyl]-butyric acid::CHEMBL88851
SMILES CC(C)C[C@H](NC(=O)CC[C@H](N)C(O)=O)C(=O)N[C@@H](CC(N)=O)C(O)=O
InChI Key InChIKey=NPHGRUHRBVZSSU-GUBZILKMSA-N
Data  1 IC50
  Tab Delimited (TSV)   2D SDfile   Computed 3D by Vconf -m prep SDfile
Find this compound or compounds like it in BindingDB:
Activity Spreadsheet -- Enzyme Inhibition Constant Data from BindingDB
Found 1 hit for monomerid = 50118649
TargetGlutathionylspermidine synthase(Crithidia fasciculata)
University Of Antwerp (Uia)
Curated by ChEMBL
LigandPNGBDBM50118649((S)-2-Amino-4-[1-((S)-(S)-2-carbamoyl-1-carboxy-et...)
Affinity DataIC50:  1.42E+5nM. Assay description: Tested against glutathionylspermidine synthetase (GspS) in Crithidia fasciculata
In DepthDetails ArticlePubMed