BDBM50118683 Acetic acid 4-[4-(4-methanesulfonyl-phenyl)-2-oxo-2,5-dihydro-furan-3-yl]-phenyl ester::CHEMBL93372
SMILES CC(=O)Oc1ccc(cc1)C1=C(COC1=O)c1ccc(cc1)S(C)(=O)=O
InChI Key InChIKey=FXVJCDBNHDKTKV-UHFFFAOYSA-N
Data  2 IC50
  Tab Delimited (TSV)   2D SDfile   Computed 3D by Vconf -m prep SDfile
Find this compound or compounds like it in BindingDB:
Activity Spreadsheet -- Enzyme Inhibition Constant Data from BindingDB
Found 2 hits for monomerid = 50118683
TargetProstaglandin G/H synthase 2(Homo sapiens (Human))
University Of Alberta
Curated by ChEMBL
LigandPNGBDBM50118683(Acetic acid 4-[4-(4-methanesulfonyl-phenyl)-2-oxo-...)
Affinity DataIC50:  1.30nM. Assay description: In vitro inhibitory concentration of compound required to inhibit Prostaglandin G/H synthase 2 enzyme was determined
In DepthDetails ArticlePubMed
TargetProstaglandin G/H synthase 1(Homo sapiens (Human))
University Of Alberta
Curated by ChEMBL
LigandPNGBDBM50118683(Acetic acid 4-[4-(4-methanesulfonyl-phenyl)-2-oxo-...)
Affinity DataIC50: >1.00E+5nM. Assay description: In vitro inhibitory concentration of compound required to inhibit Prostaglandin G/H synthase 1 enzyme was determined
In DepthDetails ArticlePubMed