BDBM50119193 1-[4-(4-{[2-Hydroxy-2-(4-hydroxy-3-methanesulfonylamino-phenyl)-ethylamino]-methyl}-piperidine-1-sulfonyl)-phenyl]-1H-pyrazole-4-carboxylic acid::CHEMBL101606
SMILES CS(=O)(=O)Nc1cc(ccc1O)[C@@H](O)CNCC1CCN(CC1)S(=O)(=O)c1ccc(cc1)-n1cc(cn1)C(O)=O
InChI Key InChIKey=AYDIROIWJSURNI-DEOSSOPVSA-N
Data  3 EC50
  Tab Delimited (TSV)   2D SDfile   Computed 3D by Vconf -m prep SDfile
Find this compound or compounds like it in BindingDB:
Activity Spreadsheet -- Enzyme Inhibition Constant Data from BindingDB
Found 3 hits for monomerid = 50119193
TargetBeta-2 adrenergic receptor(Homo sapiens (Human))
Wyeth Research
Curated by ChEMBL
LigandPNGBDBM50119193(1-[4-(4-{[2-Hydroxy-2-(4-hydroxy-3-methanesulfonyl...)
Affinity DataEC50:  10nM. Assay description: Beta-2 adrenergic receptor agonist activity as increased cAMP levels in CHO cells expressing human Beta2-adrenoreceptor
In DepthDetails ArticlePubMed
TargetBeta-3 adrenergic receptor(Homo sapiens (Human))
Wyeth Research
Curated by ChEMBL
LigandPNGBDBM50119193(1-[4-(4-{[2-Hydroxy-2-(4-hydroxy-3-methanesulfonyl...)
Affinity DataEC50:  43nM. Assay description: Beta-3 adrenergic receptor agonist activity as increased cAMP levels in CHO cells expressing human Beta3-adrenoreceptor
In DepthDetails ArticlePubMed
TargetBeta-1 adrenergic receptor(Homo sapiens (Human))
Wyeth Research
Curated by ChEMBL
LigandPNGBDBM50119193(1-[4-(4-{[2-Hydroxy-2-(4-hydroxy-3-methanesulfonyl...)
Affinity DataEC50:  1.00E+3nM. Assay description: Beta-1 adrenergic receptor agonist activity as increased cAMP levels in CHO cells expressing human Beta1-adrenoreceptor
In DepthDetails ArticlePubMed