BDBM50119374 CHEMBL357684::N-(3-(4-(2-methoxyphenyl)piperazin-1-yl)propyl)H-pyrazolo[1,5-a]pyridine-2-carboxamide::Pyrazolo[1,5-a]pyridine-2-carboxylic acid {3-[4-(2-methoxy-phenyl)-piperazin-1-yl]-propyl}-amide
SMILES COc1ccccc1N1CCN(CCCNC(=O)c2cc3ccccn3n2)CC1
InChI Key InChIKey=UMEFKDHFJIKPGP-UHFFFAOYSA-N
Data  7 KI
  Tab Delimited (TSV)   2D SDfile   Computed 3D by Vconf -m prep SDfile
Find this compound or compounds like it in BindingDB:
Activity Spreadsheet -- Enzyme Inhibition Constant Data from BindingDB
Found 7 hits for monomerid = 50119374
TargetD(4) dopamine receptor(Homo sapiens (Human))
Friedrich-Alexander University
Curated by ChEMBL
LigandPNGBDBM50119374(CHEMBL357684 | N-(3-(4-(2-methoxyphenyl)piperazin-...)
Affinity DataKi:  41nM. Assay description: Binding affinity for human Dopamine receptor D4 by [3H]- spiperone displacement.
In DepthDetails ArticlePubMed
TargetD(2) dopamine receptor(Homo sapiens (Human))
Friedrich-Alexander University
Curated by ChEMBL
LigandPNGBDBM50119374(CHEMBL357684 | N-(3-(4-(2-methoxyphenyl)piperazin-...)
Affinity DataKi:  150nM. Assay description: Displacement of [3H]spiperone from human dopamine D2L receptor expressed in CHO cell membranes by radioligand competition binding assay
In DepthDetails ArticlePubMed
Target5-hydroxytryptamine receptor 2A(Homo sapiens (Human))
Friedrich-Alexander University
Curated by ChEMBL
LigandPNGBDBM50119374(CHEMBL357684 | N-(3-(4-(2-methoxyphenyl)piperazin-...)
Affinity DataKi:  560nM. Assay description: Displacement of [3H]ketanserin from human 5-HT2A receptor expressed in HEK293 cell membranes by radioligand competition binding assay
In DepthDetails ArticlePubMed
TargetD(3) dopamine receptor(Homo sapiens (Human))
Friedrich-Alexander University
Curated by ChEMBL
LigandPNGBDBM50119374(CHEMBL357684 | N-(3-(4-(2-methoxyphenyl)piperazin-...)
Affinity DataKi:  650nM. Assay description: Binding affinity for human Dopamine receptor D3 by [3H]- spiperone displacement.
In DepthDetails ArticlePubMed
TargetD(2) dopamine receptor(Homo sapiens (Human))
Friedrich-Alexander University
Curated by ChEMBL
LigandPNGBDBM50119374(CHEMBL357684 | N-(3-(4-(2-methoxyphenyl)piperazin-...)
Affinity DataKi:  830nM. Assay description: Binding affinity for human Dopamine receptor D2 (long) by [3H]- spiperone displacement.
In DepthDetails ArticlePubMed
TargetD(2) dopamine receptor(Homo sapiens (Human))
Friedrich-Alexander University
Curated by ChEMBL
LigandPNGBDBM50119374(CHEMBL357684 | N-(3-(4-(2-methoxyphenyl)piperazin-...)
Affinity DataKi:  970nM. Assay description: Binding affinity for human Dopamine receptor D2 (short) by [3H]- spiperone displacement.
In DepthDetails ArticlePubMed
TargetD(1A) dopamine receptor(Homo sapiens (Human))
Friedrich-Alexander University
Curated by ChEMBL
LigandPNGBDBM50119374(CHEMBL357684 | N-(3-(4-(2-methoxyphenyl)piperazin-...)
Affinity DataKi:  1.20E+3nM. Assay description: Binding affinity for porcine Dopamine receptor D1 by [3H]-SCH- 23390 displacement.
In DepthDetails ArticlePubMed