BDBM50119951 1-(2-Methyl-2,3-dihydro-indol-1-yl)-2-[4-(3-trifluoromethoxy-benzyl)-piperazin-1-yl]-ethanone::CHEMBL419908
SMILES CC1Cc2ccccc2N1C(=O)CN1CCN(Cc2cccc(OC(F)(F)F)c2)CC1
InChI Key InChIKey=IXMZAEHXCUOHCK-UHFFFAOYSA-N
Data  3 KI
  Tab Delimited (TSV)   2D SDfile   Computed 3D by Vconf -m prep SDfile
Find this compound or compounds like it in BindingDB:
Activity Spreadsheet -- Enzyme Inhibition Constant Data from BindingDB
Found 3 hits for monomerid = 50119951
TargetD(4) dopamine receptor(Homo sapiens (Human))
Neurogen
Curated by ChEMBL
LigandPNGBDBM50119951(1-(2-Methyl-2,3-dihydro-indol-1-yl)-2-[4-(3-triflu...)
Affinity DataKi:  6nM. Assay description: Binding affinity towards human dopamine D4 receptor was determined via standard competitive displacement assays using [3H]-YM 09151 as radioligand
In DepthDetails ArticlePubMed
TargetD(2) dopamine receptor(Homo sapiens (Human))
Neurogen
Curated by ChEMBL
LigandPNGBDBM50119951(1-(2-Methyl-2,3-dihydro-indol-1-yl)-2-[4-(3-triflu...)
Affinity DataKi:  620nM. Assay description: Binding affinity towards human dopamine D2 receptor, using [3H]-YM-09151 as a radioligand
In DepthDetails ArticlePubMed
TargetAlpha-1A/Alpha-1B/Alpha-1D adrenergic receptor(Rattus norvegicus (rat))
Neurogen
Curated by ChEMBL
LigandPNGBDBM50119951(1-(2-Methyl-2,3-dihydro-indol-1-yl)-2-[4-(3-triflu...)
Affinity DataKi: >1.00E+3nM. Assay description: Binding affinity towards Alpha-1 adrenergic receptor via standard competitive displacement assay using rat brain homogenate with [3H]prazosin as radi...
In DepthDetails ArticlePubMed