BDBM50120426 CHEMBL3617968
SMILES CC(=O)C1=C(C)N(C(=O)N[C@@H]1c1ccc(nc1)C#N)c1cccc(c1)C(F)(F)F
InChI Key InChIKey=PGIVGIFOWOVINL-GOSISDBHSA-N
Data  1 KI  1 IC50
PDB links: 1 PDB ID matches this monomer.
  Tab Delimited (TSV)   2D SDfile   Computed 3D by Vconf -m prep SDfile
Find this compound or compounds like it in BindingDB:
Activity Spreadsheet -- Enzyme Inhibition Constant Data from BindingDB
Found 1 hit for monomerid = 50120426
TargetNeutrophil elastase(Homo sapiens (Human))
University Of Florence
Curated by ChEMBL
LigandPNGBDBM50120426(CHEMBL3617968)
Affinity DataIC50:  15nM. Assay description: Inhibition of human neutrophil elastase using N-methylsuccinyl-Ala-Ala-Pro-Val-7-amino-4-methylcoumarin as substrate measured every 30 secs for 10 mi...