BDBM50120537 8-Methyl-2-[4-(3-piperidin-1-yl-propoxy)-phenyl]-imidazo[1,2-a]pyridine::CHEMBL72022
SMILES Cc1cccn2cc(nc12)-c1ccc(OCCCN2CCCCC2)cc1
InChI Key InChIKey=IUKYHUQESODSDZ-UHFFFAOYSA-N
Data  2 KI
  Tab Delimited (TSV)   2D SDfile   Computed 3D by Vconf -m prep SDfile
Find this compound or compounds like it in BindingDB:
Activity Spreadsheet -- Enzyme Inhibition Constant Data from BindingDB
Found 2 hits for monomerid = 50120537
TargetHistamine H3 receptor(Homo sapiens (Human))
Johnson And Johnson Pharmaceutical Research And Development
Curated by ChEMBL
LigandPNGBDBM50120537(8-Methyl-2-[4-(3-piperidin-1-yl-propoxy)-phenyl]-i...)
Affinity DataKi:  3nM. Assay description: Antagonist activity for human histamine H3 receptor was determined
In DepthDetails ArticlePubMed
TargetHistamine H3 receptor(Homo sapiens (Human))
Johnson And Johnson Pharmaceutical Research And Development
Curated by ChEMBL
LigandPNGBDBM50120537(8-Methyl-2-[4-(3-piperidin-1-yl-propoxy)-phenyl]-i...)
Affinity DataKi:  3nM. Assay description: Binding affinity for human histamine H3 receptor
In DepthDetails ArticlePubMed