BDBM50120763 CHEMBL358076::Cyclopentanecarboxylic acid (7-ethyl-2-phenyl-imidazo[1,2-a][1,3,5]triazin-4-yl)-amide
SMILES CCc1cn2c(NC(=O)C3CCCC3)nc(nc2n1)-c1ccccc1
InChI Key InChIKey=RGWDXSHSTWLQKS-UHFFFAOYSA-N
Data  3 KI
  Tab Delimited (TSV)   2D SDfile   Computed 3D by Vconf -m prep SDfile
Find this compound or compounds like it in BindingDB:
Activity Spreadsheet -- Enzyme Inhibition Constant Data from BindingDB
Found 3 hits for monomerid = 50120763
TargetAdenosine receptor A1(BOVINE)
Università
Curated by ChEMBL
LigandPNGBDBM50120763(CHEMBL358076 | Cyclopentanecarboxylic acid (7-ethy...)
Affinity DataKi:  3.30nM. Assay description: Displacement of [3H]-CHA from Adenosine A1 receptor in bovine cortical membranes.
In DepthDetails ArticlePubMed
TargetAdenosine receptor A3(Homo sapiens (Human))
Università
Curated by ChEMBL
LigandPNGBDBM50120763(CHEMBL358076 | Cyclopentanecarboxylic acid (7-ethy...)
Affinity DataKi:  20.2nM. Assay description: Displacement of [125I]-AB-MECA from Adenosine A3 receptor in bovine cortical membranes in the presence of 20 nM DPCPX.
In DepthDetails ArticlePubMed
TargetAdenosine receptor A2a(Homo sapiens (Human))
Università
Curated by ChEMBL
LigandPNGBDBM50120763(CHEMBL358076 | Cyclopentanecarboxylic acid (7-ethy...)
Affinity DataKi:  2.60E+3nM. Assay description: Displacement of [3H]- CGS-21,680 from Adenosine A2a receptor in bovine striatal membranes.
In DepthDetails ArticlePubMed