BDBM50120796 CHEMBL3618363
SMILES COc1cc(ccc1OCC(C)O)-n1cnn2cc(cc2c1=O)-c1ccc(Cl)cc1
InChI Key InChIKey=WBRMOXASXLNSBO-UHFFFAOYSA-N
Data  1 KI
  Tab Delimited (TSV)   2D SDfile   Computed 3D by Vconf -m prep SDfile
Find this compound or compounds like it in BindingDB:
Activity Spreadsheet -- Enzyme Inhibition Constant Data from BindingDB
Found 1 hit for monomerid = 50120796
TargetMelanin-concentrating hormone receptor 1(RAT)
Bristol-Myers Squibb Research And Development
Curated by ChEMBL
LigandPNGBDBM50120796(CHEMBL3618363)
Affinity DataKi:  1.40nM. Assay description: Displacement of [125I][Phe13,Tyr19]-MCH from rat MCHR1 by scintillation counting analysis
In DepthDetails ArticlePubMed