BDBM50121155 5-(3-Methoxy-phenyl)-3,3-dimethyl-1,3-dihydro-indol-2-one::CHEMBL118042
SMILES COc1cccc(c1)-c1ccc2NC(=O)C(C)(C)c2c1
InChI Key InChIKey=OWQAYYLCRJWAKR-UHFFFAOYSA-N
Data  1 IC50
  Tab Delimited (TSV)   2D SDfile   Computed 3D by Vconf -m prep SDfile
Find this compound or compounds like it in BindingDB:
Activity Spreadsheet -- Enzyme Inhibition Constant Data from BindingDB
Found 1 hit for monomerid = 50121155
TargetProgesterone receptor(Homo sapiens (Human))
Wyeth Research
Curated by ChEMBL
LigandPNGBDBM50121155(5-(3-Methoxy-phenyl)-3,3-dimethyl-1,3-dihydro-indo...)
Affinity DataIC50:  300nM. Assay description: Progesterone receptor antagonist activity based on its ability to block progesterone induced alkaline phosphatase in the human breast cancer cell lin...
In DepthDetails ArticlePubMed