BDBM50121173 5'-(3-chlorophenyl)spiro[cyclobutane-1,3'-indol]-2'(1'H)-one::CHEMBL324499
SMILES Clc1cccc(c1)-c1ccc2NC(=O)C3(CCC3)c2c1
InChI Key InChIKey=GYSRYBPJNDBMKL-UHFFFAOYSA-N
Data  1 IC50
  Tab Delimited (TSV)   2D SDfile   Computed 3D by Vconf -m prep SDfile
Find this compound or compounds like it in BindingDB:
Activity Spreadsheet -- Enzyme Inhibition Constant Data from BindingDB
Found 1 hit for monomerid = 50121173
TargetProgesterone receptor(Homo sapiens (Human))
Wyeth Research
Curated by ChEMBL
LigandPNGBDBM50121173(5'-(3-chlorophenyl)spiro[cyclobutane-1,3'-indol]-2...)
Affinity DataIC50:  71nM. Assay description: Progesterone receptor antagonist activity based on its ability to block progesterone induced alkaline phosphatase in the human breast cancer cell lin...
In DepthDetails ArticlePubMed