BDBM50121179 5-(3-Chloro-phenyl)-1,3-dihydro-indol-2-one::CHEMBL117849
SMILES Clc1cccc(c1)-c1ccc2NC(=O)Cc2c1
InChI Key InChIKey=LWHARHQOLDBWIF-UHFFFAOYSA-N
Data  1 IC50
  Tab Delimited (TSV)   2D SDfile   Computed 3D by Vconf -m prep SDfile
Find this compound or compounds like it in BindingDB:
Activity Spreadsheet -- Enzyme Inhibition Constant Data from BindingDB
Found 1 hit for monomerid = 50121179
TargetProgesterone receptor(Homo sapiens (Human))
Wyeth Research
Curated by ChEMBL
LigandPNGBDBM50121179(5-(3-Chloro-phenyl)-1,3-dihydro-indol-2-one | CHEM...)
Affinity DataIC50:  296nM. Assay description: Progesterone receptor antagonist activity based on its ability to block progesterone induced alkaline phosphatase in the human breast cancer cell lin...
In DepthDetails ArticlePubMed