BDBM50121341 CHEMBL3622093
SMILES Brc1ccc(NCCN2CCN(Cc3cc4ccccc4[nH]3)CC2)cc1
InChI Key InChIKey=CCHNZOHVOULQIT-UHFFFAOYSA-N
Data  2 KI
  Tab Delimited (TSV)   2D SDfile   Computed 3D by Vconf -m prep SDfile
Find this compound or compounds like it in BindingDB:
Activity Spreadsheet -- Enzyme Inhibition Constant Data from BindingDB
Found 2 hits for monomerid = 50121341
TargetD(2) dopamine receptor(Homo sapiens (Human))
Universit Degli Studi Di Milano
Curated by ChEMBL
LigandPNGBDBM50121341(CHEMBL3622093)
Affinity DataKi:  920nM. Assay description: Displacement of [3H]spiperone from human dopamine D2L receptor expressed in CHO cells
In DepthDetails ArticlePubMed
TargetD(3) dopamine receptor(Homo sapiens (Human))
Universit Degli Studi Di Milano
Curated by ChEMBL
LigandPNGBDBM50121341(CHEMBL3622093)
Affinity DataKi:  2.30E+3nM. Assay description: Displacement of [3H]spiperone from human dopamine D3 receptor expressed in CHO cells
In DepthDetails ArticlePubMed