BDBM50121352 2-(2-Chloro-6-methyl-phenyl)-3-(5-methyl-pyridin-2-yl)-thiazolidin-4-one::CHEMBL346225
SMILES Cc1ccc(nc1)N1C(SCC1=O)c1c(C)cccc1Cl
InChI Key InChIKey=OSVWVWWNZYVKLO-UHFFFAOYSA-N
Data  1 IC50
  Tab Delimited (TSV)   2D SDfile   Computed 3D by Vconf -m prep SDfile
Find this compound or compounds like it in BindingDB:
Activity Spreadsheet -- Enzyme Inhibition Constant Data from BindingDB
Found 1 hit for monomerid = 50121352
TargetReverse transcriptase/RNaseH(Human immunodeficiency virus 1)
Università
Curated by ChEMBL
LigandPNGBDBM50121352(2-(2-Chloro-6-methyl-phenyl)-3-(5-methyl-pyridin-2...)
Affinity DataIC50:  4.24E+4nM. Assay description: HIV-1 reverse transcriptase (RT) activity using Poly (rC)/oligo (dG) as template/primer and [3H]dGTP
In DepthDetails ArticlePubMed