BDBM50121354 2-(2-Fluoro-6-methyl-phenyl)-3-(6-methyl-pyridin-2-yl)-thiazolidin-4-one::CHEMBL359315
SMILES Cc1cccc(n1)N1C(SCC1=O)c1c(C)cccc1F
InChI Key InChIKey=WCBHLHHABJJEHT-UHFFFAOYSA-N
Data  1 IC50
  Tab Delimited (TSV)   2D SDfile   Computed 3D by Vconf -m prep SDfile
Find this compound or compounds like it in BindingDB:
Activity Spreadsheet -- Enzyme Inhibition Constant Data from BindingDB
Found 1 hit for monomerid = 50121354
TargetReverse transcriptase/RNaseH(Human immunodeficiency virus 1)
Università
Curated by ChEMBL
LigandPNGBDBM50121354(2-(2-Fluoro-6-methyl-phenyl)-3-(6-methyl-pyridin-2...)
Affinity DataIC50:  2.85E+3nM. Assay description: HIV-1 reverse transcriptase (RT) activity using Poly (rC)/oligo (dG) as template/primer and [3H]dGTP
In DepthDetails ArticlePubMed