BDBM50121429 2-(6-Isopropenyl-3-methyl-cyclohex-2-enyl)-5-pentyl-benzene-1,3-diol::2-(6-Isopropenyl-3-methyl-cyclohex-2-enyl)-5-pentyl-benzene-1,3-diol (Cannabidiol)::CBD::Cannabidiol
SMILES [H][C@]1(C=C(C)CC[C@H]1C(C)=C)c1c(O)cc(CCCCC)cc1O
InChI Key InChIKey=QHMBSVQNZZTUGM-ZWKOTPCHSA-N
Data  3 KI
PDB links: 11 PDB IDs match this monomer.
  Tab Delimited (TSV)   2D SDfile   Computed 3D by Vconf -m prep SDfile
Find this compound or compounds like it in BindingDB:
Activity Spreadsheet -- Enzyme Inhibition Constant Data from BindingDB
Found 3 hits for monomerid = 50121429
TargetFatty acid-binding protein, liver(Mus musculus (Mouse))
Avanti Polar Lipids
LigandPNGBDBM50121429(2-(6-Isopropenyl-3-methyl-cyclohex-2-enyl)-5-penty...)
Affinity DataKi:  167nM. Assay description: The following fluorescent ligand displacement assays at 24 °C were used to further confirm and/or determine if the cytosolic lipidic ligand "chaperon...
In DepthDetails ArticlePubMed
TargetCannabinoid receptor 2(MOUSE)
National Hellenic Research Foundation
Curated by ChEMBL
LigandPNGBDBM50121429(2-(6-Isopropenyl-3-methyl-cyclohex-2-enyl)-5-penty...)
Affinity DataKi:  1.26E+3nM. Assay description: Binding affinity for Cannabinoid receptor 2 by the ability to displace radiolabeled CP-55,940 from mouse spleen synaptosomes
In DepthDetails ArticlePubMed
TargetCannabinoid receptor 1(Rattus norvegicus (rat))
National Hellenic Research Foundation
Curated by ChEMBL
LigandPNGBDBM50121429(2-(6-Isopropenyl-3-methyl-cyclohex-2-enyl)-5-penty...)
Affinity DataKi:  1.27E+3nM. Assay description: Binding affinity for Cannabinoid receptor 1 by the ability to displace radiolabeled CP-55,940 from purified rat forbrain synaptosomes
In DepthDetails ArticlePubMed