BDBM50121708 CHEMBL168510::MPAQ-22
SMILES CCc1cccc(CC)c1-n1c(=O)n(C)c2ccccc2c1=O
InChI Key InChIKey=RUHAOZTWLKUJFF-UHFFFAOYSA-N
Data  1 IC50
  Tab Delimited (TSV)   2D SDfile   Computed 3D by Vconf -m prep SDfile
Find this compound or compounds like it in BindingDB:
Activity Spreadsheet -- Enzyme Inhibition Constant Data from BindingDB
Found 1 hit for monomerid = 50121708
TargetPuromycin-sensitive aminopeptidase(Homo sapiens (Human))
The University Of Tokyo
Curated by ChEMBL
LigandPNGBDBM50121708(CHEMBL168510 | MPAQ-22)
Affinity DataIC50:  3.40E+3nM. Assay description: Puromycin sensitive aminopeptidase inhibitory activity of the compound was determined by the use of L-Ala AMC with MOLT-4
In DepthDetails ArticlePubMed