BDBM50121894 6-Bromo-2-pentanoylamino-1,2,3,4-tetrahydro-naphthalene-2-carboxylic acid ((S)-1-{(S)-1-[(S)-1-(carbamoylmethyl-carbamoyl)-2-(1H-indol-3-yl)-ethylcarbamoyl]-4-guanidino-butylcarbamoyl}-2-phenyl-ethyl)-amide::CHEMBL29511
SMILES CCCCC(=O)NC1(CCc2cc(Br)ccc2C1)C(=O)N[C@H](Cc1ccccc1)C(=O)N[C@@H](CCCNC(N)=N)C(=O)N[C@@H](Cc1c[nH]c2ccccc12)C(=O)NCC(N)=O
InChI Key InChIKey=NVXHRVANZYMLLN-DBNFJDLDSA-N
Data  2 EC50
  Tab Delimited (TSV)   2D SDfile   Computed 3D by Vconf -m prep SDfile
Find this compound or compounds like it in BindingDB:
Activity Spreadsheet -- Enzyme Inhibition Constant Data from BindingDB
Found 2 hits for monomerid = 50121894
TargetMelanocyte-stimulating hormone receptor(Homo sapiens (Human))
Roche Research Center
Curated by ChEMBL
LigandPNGBDBM50121894(6-Bromo-2-pentanoylamino-1,2,3,4-tetrahydro-naphth...)
Affinity DataEC50:  4.63E+3nM. Assay description: Agonist activity against human melanocortin receptor hMC1R
In DepthDetails ArticlePubMed
TargetMelanocyte-stimulating hormone receptor(Homo sapiens (Human))
Roche Research Center
Curated by ChEMBL
LigandPNGBDBM50121894(6-Bromo-2-pentanoylamino-1,2,3,4-tetrahydro-naphth...)
Affinity DataEC50:  4.63E+3nM. Assay description: Agonist activity against human melanocortin receptor hMC1R
In DepthDetails ArticlePubMed