BDBM50121989 CHEMBL3617310
SMILES Fc1ccc(cc1)S(=O)(=O)N1CCCc2ccc(NC(=O)c3ccno3)cc12
InChI Key InChIKey=ATHAKQRTZUHYIF-UHFFFAOYSA-N
Data  1 EC50
  Tab Delimited (TSV)   2D SDfile   Computed 3D by Vconf -m prep SDfile
Find this compound or compounds like it in BindingDB:
Activity Spreadsheet -- Enzyme Inhibition Constant Data from BindingDB
Found 1 hit for monomerid = 50121989
TargetNuclear receptor ROR-gamma(Homo sapiens (Human))
Genentech
Curated by ChEMBL
LigandPNGBDBM50121989(CHEMBL3617310)
Affinity DataEC50:  7.40E+3nM. Assay description: Inverse agonist activity at N-terminal 6xHis-tagged human RORc ligand binding domain (241 to 486) expressed in bacterial expression system assessed a...
In DepthDetails ArticlePubMed