BDBM50122098 CHEMBL413964::N-{4-[(3-Cyano-4-hydroxy-benzoyl)-hydrazonomethyl]-3-methoxy-phenyl}-3-(4-trifluoromethyl-phenyl)-propionamide
SMILES COc1cc(NC(=O)CCc2ccc(cc2)C(F)(F)F)ccc1\C=N\NC(=O)c1ccc(O)c(c1)C#N
InChI Key InChIKey=KKUMRKCHDDZWQQ-IBBHUPRXSA-N
Data  1 IC50
  Tab Delimited (TSV)   2D SDfile   Computed 3D by Vconf -m prep SDfile
Find this compound or compounds like it in BindingDB:
Activity Spreadsheet -- Enzyme Inhibition Constant Data from BindingDB
Found 1 hit for monomerid = 50122098
TargetGlucagon receptor(Homo sapiens (Human))
Novo Nordisk
Curated by ChEMBL
LigandPNGBDBM50122098(CHEMBL413964 | N-{4-[(3-Cyano-4-hydroxy-benzoyl)-h...)
Affinity DataIC50:  15.7nM. Assay description: In vitro binding affinity for recombinant human glucagon receptor (hGGR) in BHK cells
In DepthDetails ArticlePubMed