BDBM50122106 3-Fluoro-4-hydroxy-benzoic acid (4-hydroxymethyl-naphthalen-1-ylmethylene)-hydrazide::CHEMBL153905
SMILES OCc1ccc(\C=N\NC(=O)c2ccc(O)c(F)c2)c2ccccc12
InChI Key InChIKey=SJEQPXGXMCTCKR-UFFVCSGVSA-N
Data  1 IC50
  Tab Delimited (TSV)   2D SDfile   Computed 3D by Vconf -m prep SDfile
Find this compound or compounds like it in BindingDB:
Activity Spreadsheet -- Enzyme Inhibition Constant Data from BindingDB
Found 1 hit for monomerid = 50122106
TargetGlucagon receptor(Homo sapiens (Human))
Novo Nordisk
Curated by ChEMBL
LigandPNGBDBM50122106(3-Fluoro-4-hydroxy-benzoic acid (4-hydroxymethyl-n...)
Affinity DataIC50:  29.4nM. Assay description: In vitro binding affinity for recombinant human glucagon receptor (hGGR) in BHK cells
In DepthDetails ArticlePubMed